{"text_format":"3","workbook":"xlsx","n_sheets":8,"sheets":["INSTRUCTIONS","1. Risk Rating Guide","2. HazardList","3.  Task Risk Assessment","4.  Employees","5. Training Expectations","6.  Training Verification","7.  Equipment"],"not_rendered":{"images":4,"defined_names":7},"read":"whole","date_system":"1900"}

{"sheet":"INSTRUCTIONS","index":0,"n_rows":0,"n_cols":0,"rows_kept":0}

{"sheet":"1. Risk Rating Guide","index":1,"n_rows":0,"n_cols":0,"rows_kept":0}

{"sheet":"2. HazardList","index":2,"n_rows":65,"n_cols":8,"rows_kept":65}
["1 Hazard Name","2 Description","3 Effect","4 Severity Rating","5 Likelihood Rating","6 Controls","7 Severity Rating","8 Likelihood Rating"]
["Adjacent work/process","Simultaneous Operations (SIMOPS)","Hazards created from other work groups in the area.",5,5,"Careful coordination with adjacent work groups to minimize hazards to others in the area. Potentially re-schedule work tasks to minimize or eliminate SIMOPS hazards.",5,1]
["Aerial Lift","Articulating and Straight Boom","Fall, Struck by, Pinch point, Carbon Monoxide Poisoning",5,4,"Inspect for defects. Test controls. Ensure the battery is charged. Inform affected workers about lift operation pinch points. Use a fall restraint system/full body harness/lanyard. Move the lift only while in the fully lowered position. Establish good housekeeping on platform decks. Use the lift only on smooth, solid, level surfaces. Observe rated capacity. Maintain a clear view of the area being navigated. Establish good housekeeping on platform decks. Use only for positioning workers/tools/equipment. Ensure that all tools and equipment fit within the basket. Barricade the area under the lift. Ensure a clear view of the work area for lift. Turn off gas powered lifts immediately after they are positioned inside a structure.",{"$f":"D3","v":5},1]
["Asbestos","Working around operations where asbestos is present and potentially disturbed byt sanding, scraping or drilling","Asbestosis, Lung cancer, Mesothelioma",4,3,"Identify materials asbestos, leave the area immediately, ensure that only certified abatement personnel remove  asbestos",4,1]
["Blood borne pathogens: e.g. AIDS virus and Hepatitis B virus","Contact with infected body fluids: e.g. medical and first aid personnel, sewage workers. Contact with contaminated blood products and dental, medical piercing instruments, e.g. patients","Acute: HIV positive; Hepatitis B infection.\nChronic: Carrier of AIDS and Hepatitis B Virus; AIDS (fatal);Hepatitis B Virus - liver failure and cancer (fatal)",3,3,"Only trained and qualified persons may handle and dispose of biohazard materials",3,1]
["Chainsaw","Chainsaws are efficient and productive portable power tools used in many industries. They are also potentially dangerous if not used correctly and carefully. Proper operation and maintenance greatly reduce the risk for injury when using chainsaws.","Severe lacerations, amputations, fatality.",5,4,"Only experienced and trained personnel may operate a chainsaw on Haskell projects.\nThe operator is required to wear chaps while using a chainsaw. This can greatly reduce or eliminate the most common injuries to the legs.\nHearing, eye and face protection shall also be worn by the operator while using a chainsaw.\nReview the OSHA fact sheet \"Working Safely with Chainsaws. Available on the Haskell website.\nGo to  www.haskellcorp.com > SAFETY > SAFETY RESOURCES > OSHA > Working Safely with Chainsaws",5,1]
["Cold Stress","Cold water; cool high winds e.g. work outside in cold climate; work inside fridges/freezers. May aggravate pre-existing conditions, e.g. musculo-skeletal problems","Hypothermia; frost bite",3,4,"Radiant heaters may be used to warm workers. Shield work areas from drafts or wind. Use insulating material on equipment handles when temperatures drop below 30° F.",3,1]
["Confined Space","Entry into tanks, vaults or other spaces not intended for human occupancy.","Asphyxiation, fire, engulfment",5,4,"Confined space attendant, atmospheric monitoring, adequate ventillation. Ensure that rescue equipment is available and in place.\nFor excavations - Ensure means of egress within 25 feet of all entrants into space. Ensure that internal combustion powered equipment does not pose  CO hazards.",5,1]
["Cranes - Critical Lift","Critical lift means a lift that (1) exceeds 75 percent of the rated capacity of the crane or derrick, or (2) requires the use of more than one crane or derrick.","Dropped loads, Struck by, Pinch points, Crushing, Electric shock",5,4,"Crane operator shall be competent, possess an Operator`s License and 3rd party certificate. Lift plan in place and reviewed by affected persons. Mobile crane shall be set up correctly on firm round, placed level, outrigger fully extend, outrigger pads placed on mats before any lifting activity. Inspect all rigging for defects. Barricade area under fall/hoist area. Determine and observe rated capacity. Ensure the correct type of sling is selected for the job. Protect rigging from sharp edges, use  ofteners. Tagline ropes shall be used to control the movement of the suspended objects. Keep loads and lines 10' or more away from energized electrical conductors. Establish hoist equipment load limits. Establish good housekeeping in the work area. Barricade the hoist area. Ensure affected people in the area are aware of the operation. Ensure that the signal person and operator agree upon and understand signals.",5,1]
["Cranes, Chainfall, Hoisting","Moving loads by crane or other lifting device","Struck by, pinch point, Electric shock",5,4,"Inspect for defects, barricade area under fall/hoist  area, determine and observe rated capacity, ensure the correct type of sling is selected for the job, protect rigging from sharp edges, use softeners,  Keep loads and lines 10' or more away from energized electrical conductors.\nEstablish hoist equipment load limits. Establish good housekeeping in the work area. Barricade the hoist area. Ensure affected people in the area are aware of the operation. Ensure that the signal person and operator agree upon and understand signals.",5,1]
["Employee Inexperience","New employeess, employees who have recently taken a new position","Accidents related to lack of training and experience",4,5,"ID Program, Increased foreman oversight, mentorship by senior worker",3,1]
["Engulfment","Collapse of excavation","Suffocation, Crushing Injury",4,5,"Shoring, Sloping, Benching of excavation. Spoils removed from site. Spoils maintained at a minimum of 2 feet from edge of excavation.  Mobile equipment kept away from while entrants are in the excavation.",4,1]
["Ergonomics- Body strain","Repetitive strain injury, discomfort in an office chair or desk, poor design of a particular job or task at a workplace that causes injury, manual handling of heavy loads, and anything in the environment that leads to uncomfortable or unnatural body positioning that can lead to injury.\n","Muscle strains, sprains, soft tissue injury",3,4,"Proper lifting mechanics, Get help to lift/move, use mechanical advantage/equipment",{"$f":"D13","v":3},1]
["Excavation","Sloughing of excavation walls, engulfment, water accumulation, equipment and materials falling into excavation","Asphyxiation,  engulfment, drowning, crushing, death",5,5,"Confined space attendant, atmospheric monitoring, daily inspections by competent person",5,1]
["Falling Objects","Unsecured objects, tools and materials could fall onto workers and equipment below.","Struck by injuries",4,5,"Tool lanyards, material screen, barricades, signage, situational awareness",4,1]
["Fatigue","Sleepiness, loss of focus/concentration, increase in work mistakes, shortcuts","Sleepiness, loss of focus/concentration, increase in work mistakes, shortcuts",4,5,"Fatigue management program",4,1]
["Fire","Welding operations may ignite flammable materials nearby","Burns, death",4,4,"Fire watch, Remove all combustible materials from the work area.\nRequest and receive a hot work permit and follow requirements listed. A Fire Watch as required by the Permit.\nAll personnel engaged in welding or cutting job tasks shall wear all industry recognized PPE to protect from burns either to the skin or the eyes. All workers assigned to the job will review the hot work permit.\nA 20 pound Type ABC fire extinguisher shall be readily accessible and immediately available when any open flame work is performed. \nCombustibles and flammables must be kept clear of the open flame work area. \nFire watches shall be trained and competent in the use of fire suppression equipment. Fire extinguishers must be checked monthly. Fire watches must have the means and know to call the Fire Department in case of an emergency. Fire watches are to remain 30 minutes after completion of open flame work is stopped. \nStore oxygen and acetylene cylinders in a secured in an upright position with caps in place with a minimum of 20 feet separation or separated by a noncombustible barrier at least 5 feet high having a fire resistance rating of one half hour except when in an approved cart ready for use. Proper signage regarding “No Smoking” or “Ignition Sources” must be posted.\nSmoking is only allowed in designated smoking areas.\nButane (e.g., Bic) lighters are not allowed to be carried by contractor employees engaged in welding or torch cutting/brazing or soldering operations. \nAll torch set cylinders must have the valves closed and the system de-pressured before going to breaks or lunch. ",4,1]
["Fire - Pyrophoric","A pyrophoric material can spontaneously ignite in air. The word is derived from Greek for \"fire-bearing\". Many pyrophoric materials also react vigorously with water or high humidity, often igniting upon contact.\n\nCombustible mixtures with air can exist ","Burns, death",5,5,"Facility specific controls for pyrophorics",5,1]
["Fire w/o Firewatch","Hotwork operations may ignite flammable materials nearby","Death, Burns, Explosion, Property damage",4,4,"Remove all combustible materials from the work area.\nA 20 pound Type ABC fire extinguisher shall be readily accessible during hot work.\nFire extinguishers must be checked monthly.\nStore oxygen and acetylene cylinders in a secured in an upright position with caps in place with a minimum of 20 feet separation or separated by a noncombustible barrier at least 5 feet high having a fire resistance rating of one half hour except when in an approved cart ready for use.\nSmoking is only allowed in designated smoking areas.\nButane (e.g., Bic) lighters are not allowed to be carried by employees engaged in welding or torch cutting/brazing or soldering operations.\nAll torch set cylinders must have the valves closed and the system de-pressured before going to breaks or lunch.",4,1]
["Flying Debris","Improperly secured material, airborne chips and debris can be ejected","Struck by injuries, foreign bodies in eye",4,5,"Secure materials properly, all affected persons shall weal ANSI rated eye and face protection",4,1]
{"$rows_left_out":46}
{"sheet":"3.  Task Risk Assessment","index":3,"n_rows":100,"n_cols":10,"rows_kept":100,"merged":[[0,0,0,9],[5,1,5,6],[7,1,7,8],[10,0,11,0],[10,1,10,2],[10,3,10,5],[10,7,10,9]]}
["TASK RISK ASSESSMENT"]
[]
[]
["Job description:"]
["Sub contractor: "]
["Assessment team:",{"$nulls":6},"Approved:"]
[]
["Notes:","This is a pre-assessment based on known description of work. Revision to occur when reviewed with subcontractor. Please add any appropriate names to the assessment team above."]
[]
[null,"Date of Assessment: ",{"$nulls":4},"Due for Re-Assessment:  When reviewed with subcontractor, prior to work being started."]
["TASK","HAZARD",null,"INITIAL RISK",null,null,"CONTROLS","RESIDUAL RISK"]
[null,"Hazard Description","Hazard Effect","Hazard Severity","Likelihood ","Risk Rating","List Controls Required","Hazard Severity","Likelihood","Risk Rating"]
["List the basic tasks of your work scope from start to finish. Include site mobilization and demobilization. Leave several lines between each task.","Describe all hazards for each task based on observations and experience. \nNote: Additional hazards may be caused by interaction with other work.","Describe all effects that may be realized if hazard was to occur.","From Risk Rating Guide identify severity with no controls in place for each hazard.","From matrix identify likelihood with no controls  in place for each hazard.","Classify risk rating from matrix for each hazard","Describe fully all controls applicable for each hazard eg. If PPE is used it must be specifically described. If a control can only be verified by documentation then it must be available. All controls must reduce severity, likelihood or both","From matrix identify severity with controls in place for each hazard.","From matrix identify likelihood with controls  in place for each hazard.","Classify risk rating from matrix for each hazard"]
[null,null,{"$f":" IFERROR(VLOOKUP(B14,'2. HazardList'!$1:$1048576,3,FALSE), \"\")","v":""},{"$f":"IFERROR(VLOOKUP(B14,'2. HazardList'!$1:$1048576,4,FALSE),\"\")","v":""},{"$f":"IFERROR(VLOOKUP(B14,'2. HazardList'!$1:$1048576,5,FALSE), \"\")","v":""},{"$f":"IFERROR((D14*E14),\"\")","v":""},{"$f":" IFERROR(VLOOKUP(B14,'2. HazardList'!$1:$1048576,6,FALSE),\"\")","v":""},{"$f":"IFERROR(VLOOKUP(B14,'2. HazardList'!$1:$1048576,7,FALSE),\"\")","v":""},{"$f":"IFERROR(VLOOKUP(B14,'2. HazardList'!$1:$1048576,8,FALSE),\"\")","v":""},{"$f":"IFERROR((I14*H14),\"\")","v":""}]
[null,null,{"$f":" IFERROR(VLOOKUP(B15,'2. HazardList'!$1:$1048576,3,FALSE), \"\")","v":""},{"$f":"IFERROR(VLOOKUP(B15,'2. HazardList'!$1:$1048576,4,FALSE),\"\")","v":""},{"$f":"IFERROR(VLOOKUP(B15,'2. HazardList'!$1:$1048576,5,FALSE), \"\")","v":""},{"$f":"IFERROR((D15*E15),\"\")","v":""},{"$f":" IFERROR(VLOOKUP(B15,'2. HazardList'!$1:$1048576,6,FALSE),\"\")","v":""},{"$f":"IFERROR(VLOOKUP(B15,'2. HazardList'!$1:$1048576,7,FALSE),\"\")","v":""},{"$f":"IFERROR(VLOOKUP(B15,'2. HazardList'!$1:$1048576,8,FALSE),\"\")","v":""},{"$f":"IFERROR((I15*H15),\"\")","v":""}]
[null,null,{"$f":" IFERROR(VLOOKUP(B16,'2. HazardList'!$1:$1048576,3,FALSE), \"\")","v":""},{"$f":"IFERROR(VLOOKUP(B16,'2. HazardList'!$1:$1048576,4,FALSE),\"\")","v":""},{"$f":"IFERROR(VLOOKUP(B16,'2. HazardList'!$1:$1048576,5,FALSE), \"\")","v":""},"",{"$f":" IFERROR(VLOOKUP(B16,'2. HazardList'!$1:$1048576,6,FALSE),\"\")","v":""},{"$f":"IFERROR(VLOOKUP(B16,'2. HazardList'!$1:$1048576,7,FALSE),\"\")","v":""},{"$f":"IFERROR(VLOOKUP(B16,'2. HazardList'!$1:$1048576,8,FALSE),\"\")","v":""},""]
[null,null,{"$f":" IFERROR(VLOOKUP(B17,'2. HazardList'!$1:$1048576,3,FALSE), \"\")","v":""},{"$f":"IFERROR(VLOOKUP(B17,'2. HazardList'!$1:$1048576,4,FALSE),\"\")","v":""},{"$f":"IFERROR(VLOOKUP(B17,'2. HazardList'!$1:$1048576,5,FALSE), \"\")","v":""},"",{"$f":" IFERROR(VLOOKUP(B17,'2. HazardList'!$1:$1048576,6,FALSE),\"\")","v":""},{"$f":"IFERROR(VLOOKUP(B17,'2. HazardList'!$1:$1048576,7,FALSE),\"\")","v":""},{"$f":"IFERROR(VLOOKUP(B17,'2. HazardList'!$1:$1048576,8,FALSE),\"\")","v":""},""]
[null,null,{"$f":" IFERROR(VLOOKUP(B18,'2. HazardList'!$1:$1048576,3,FALSE), \"\")","v":""},{"$f":"IFERROR(VLOOKUP(B18,'2. HazardList'!$1:$1048576,4,FALSE),\"\")","v":""},{"$f":"IFERROR(VLOOKUP(B18,'2. HazardList'!$1:$1048576,5,FALSE), \"\")","v":""},"",{"$f":" IFERROR(VLOOKUP(B18,'2. HazardList'!$1:$1048576,6,FALSE),\"\")","v":""},{"$f":"IFERROR(VLOOKUP(B18,'2. HazardList'!$1:$1048576,7,FALSE),\"\")","v":""},{"$f":"IFERROR(VLOOKUP(B18,'2. HazardList'!$1:$1048576,8,FALSE),\"\")","v":""},""]
[null,null,{"$f":" IFERROR(VLOOKUP(B19,'2. HazardList'!$1:$1048576,3,FALSE), \"\")","v":""},{"$f":"IFERROR(VLOOKUP(B19,'2. HazardList'!$1:$1048576,4,FALSE),\"\")","v":""},{"$f":"IFERROR(VLOOKUP(B19,'2. HazardList'!$1:$1048576,5,FALSE), \"\")","v":""},"",{"$f":" IFERROR(VLOOKUP(B19,'2. HazardList'!$1:$1048576,6,FALSE),\"\")","v":""},{"$f":"IFERROR(VLOOKUP(B19,'2. HazardList'!$1:$1048576,7,FALSE),\"\")","v":""},{"$f":"IFERROR(VLOOKUP(B19,'2. HazardList'!$1:$1048576,8,FALSE),\"\")","v":""},""]
[null,null,{"$f":" IFERROR(VLOOKUP(B20,'2. HazardList'!$1:$1048576,3,FALSE), \"\")","v":""},{"$f":"IFERROR(VLOOKUP(B20,'2. HazardList'!$1:$1048576,4,FALSE),\"\")","v":""},{"$f":"IFERROR(VLOOKUP(B20,'2. HazardList'!$1:$1048576,5,FALSE), \"\")","v":""},"",{"$f":" IFERROR(VLOOKUP(B20,'2. HazardList'!$1:$1048576,6,FALSE),\"\")","v":""},{"$f":"IFERROR(VLOOKUP(B20,'2. HazardList'!$1:$1048576,7,FALSE),\"\")","v":""},{"$f":"IFERROR(VLOOKUP(B20,'2. HazardList'!$1:$1048576,8,FALSE),\"\")","v":""},""]
{"$rows_left_out":81}
{"sheet":"4.  Employees","index":4,"n_rows":1,"n_cols":1,"rows_kept":1}
["Please provide a list of employee names that will be working onsite at the project. A file will be created and kept onsite with Haskell Site Safety Manager which will include pertinant safety training documentation and qualifications."]

{"sheet":"5. Training Expectations","index":5,"n_rows":38,"n_cols":1,"rows_kept":38}
{"$rows_empty":14}
["Aerial/manlift mobile equipment use: Documentation from employer that workers operating and/or working from such vehicles are experienced and qualified training has been provided by a competent person."]
["Confined Space Entry: Documentation from employer that workers who are exposed to the hazards of confined space work are trained by a competent person. This includes those that enter confined space as well as confined space attendants."]
["COVID-19: Documentation from employer that all crew has been trained on the most current precautions and requirements for working in construction during the COVID-19 pandemic that has been issued by the state's governing body and the CDC to reduce the spread of the virus. This is a fluid event and requirements can change at any time."]
["Crane work: Documentation from employer that operators have current Mobile Crane Operator’s credentials on file with Haskell Safety prior to any crane operations."]
["Crane signaling: Documentation from employer that workers designated to perform crane signaling be competent in the application of the type of signals used, have a basic understanding of crane operation and limitations, including the crane dynamics involved in swinging and stopping loads and boom deflection from hoisting loads and demonstrate that they meet the requirements through an oral or written assessment and have passed a practical test."]
["Electrical work: If workers are directly working with or on electrical components - Documentation from employer that electricians are trained, certified and qualified. Other workers that are exposed to, but not working directly on or with electrical components should have a basic knowledge of electrical safety."]
["Excavating/Trenching: Documentation from employer that workers involved in excavation/trenching operations are trained, knowledgeable and competent of the risks involved, hazard recognition and hazard control."]
["Exposure to hazardous chemicals: Documentation from employer must show that all workers are aware of potentially hazardous chemicals, gases, fumes etc., that are present at the project site and what hazards are associated with exposure. Workers must be aware of the proper storage and disposal of chemicals associated with their work tasks, as well as what to do in the event of a spill or release."]
["Forklift operation: Documentation from employer that workers operating forklifts are taught by a trained professional in the field."]
["Heavy equipment operation: Documentation that workers operating heavy equipment, other than forklifts, are qualified operators for each piece of equipment on site. Vehicles that require operator license or certificate of formal training will require such proof."]
["Manual lifting: Documentation that workers are aware of the hazards involved with lifting materials that are heavy and/or awkward, and that they can identify physical limitations when it comes to materials handling. This includes knowing when to ask for help, whether it is another worker’s assistance or mechanical assistance.  "]
["Noise levels >85 decibels: Documentation from the employer that workers understand hearing conservation program and know when to utilize hearing protection (earplugs, ear muffs etc.) depending on the task and surrounding noise levels."]
["Personal Protective Equipment, use of and care for: Documentation from employer that workers understand appropriate use and selection of PPE required for specific tasks. Specific requirements for the PRC project will be communicated to all subcontractors and their workers prior to commencing work on the project."]
["Potential fire hazard/fire extinguishers in work area: Documentation from employer that workers exposed to the potential of fire, workers on a site that provide portable fire extinguishers or are engaged in a work task that requires the potential to utilize a fire extinguisher must be trained and knowledgeable in the operation of fire extinguishers. "]
["Respiratory protection, required or voluntary: FIT testing where appropriate to type of respirator needed and medical clearance. Documentation from employer that worker is aware of what respiratory protection is needed, why it is needed, when it is needed and what types are available. Facial hair is not allowed for workers who are in a respiratory protection program."]
["Rigging/hoisting activities: Riggers certification or proof of extensive knowledge and experience rigging, provided by employer and reviewed by Haskell."]
["Scaffold building: Documentation such as a degree, certificate or proof of training and knowledge from employer showing that workers erecting/modifying/tearing down, tagging or inspecting scaffolding are competent, experienced and knowledgeable."]
["Traffic control: Flagger certification if utilizing a flagger (when other reasonable traffic control methods do not adequately control traffic in the work zone). Workers on foot, equipment operators, drivers and spotters in internal work zones need to know the marked routes that construction vehicles will be using. For those not directly involved in controlling traffic, formal training is not required. However, JSA’s will include the hazards associated and controls to be utilized, signed by each worker that is on site and working in a high traffic zone. We will also cover this at safety meetings."]
["Power and Hand Tools: Documentation from employer that workers have the knowledge and training to operate powered and unpowered hand tools, including understanding the hazards associated with their use and the controls necessary to prevent injury to themselves and others or damage to the equipment. "]
{"$rows_left_out":6}
{"sheet":"6.  Training Verification","index":6,"n_rows":29,"n_cols":5,"rows_kept":29,"merged":[[28,0,28,4]]}
[]
[]
["Hazards, Processess or Tasks","Training Required","Yes","DOC","# Emp"]
["Confined space, permitted or non-permitted","Confined Space Entry "]
["Signaling cranes to maneuver loads","Crane Hand Signals"]
["Exposure to electricity or electrical equipment","Electrical Safety"]
["Operating any mobile equipment or machinery other thatn forklift","Equipment Operator Training"]
["Working in trenchs and excavations","Excavation & Trenching"]
["Exposure to fall from heights greater than 4'","Fall Protection"]
["Potential fire hazard/fire extinguisers in work area","Fire extinguisher training "]
["Operating any forklift","Forklift"]
["Use of hand drills, chipping guns, grinder etc.","Hand & Power Tools"]
["Hazardous chemical exposure - Employees \"Right to Know\"","Hazard Communication"]
["Noise levels > 85 decibels","Hearing Conservation"]
["Hot/Cold environment","Heat/Cold Related Illness"]
["Welding fumes - welding and grinding (stainless steel)","Hexavalent Chromium"]
["Work from ladders","Ladder safety"]
["Work that requires energy isolation","Lock out/tag out"]
["Heavy manual lifting, loading and landing.","Materials Handling"]
["Work that requires respiratory protection.","Medical clearence and respirator fit test"]
{"$rows_left_out":10}
{"sheet":"7.  Equipment","index":7,"n_rows":0,"n_cols":0,"rows_kept":0}